{"text_format":"1","workbook":"xlsx","n_sheets":8,"sheets":["Setup","ALMD","MD","OoP","PrepOP","tables","matches","e-efoa"],"not_rendered":{"charts":0,"images":0,"macros":1,"external_links":0,"defined_names":13,"comments":0,"pivot_tables":0},"unopened":[],"bounds":{"document_bytes":16777216,"sheet_cells":100000,"rows_first":2000,"rows_last":500,"rows_between":2000,"halvings":0,"cell_chars":16384,"cell_head_chars":4096},"cells_cut":0,"cells_raw":0,"read":"whole","date_system":"1900"}

{"sheet":"Setup","index":0,"n_rows":31,"n_cols":26,"rows_kept":31,"cut":false,"hidden":false,"merged":[[1,3,2,3],[10,19,11,19],[15,19,15,20],[16,19,16,20]]}
["Singles",16,null,"Θέσεις","seed"]
["Draw16_S",null,null,"3-4",{"$f":"VALUE(LEFT(F2,1))","v":4},"4 3"]
["Διοργανωτής: ","ΣΤ' ΕΝΩΣΗ",null,null,{"$f":"VALUE(RIGHT(F2,1))","v":3},null,null,null,null,null,null,null,null,null,null,null,null,null,null,null,null,null,null,null,null,"Tour lookup"]
["Έδρα αγώνων: ","ΣΑ ΤΡΙΠΟΛΗΣ",null,null,null,null,null,null,null,null,null,null,null,null,null,null,null,null,null,null,null,null,null,null,null,{"$f":"$B$8","v":43232}]
["grade: ","Ε3",null,null,null,null,null,null,null,null,null,null,null,null,null,null,null,null,null,null,null,null,null,null,null,{"$f":"TRIM(IF(OR($B$5=\"Παν\",$B$5=\"ΠανΑΓ\",$B$5=\"Open\",$B$5=\"OpenΑΓ\"),$B$5&\" (\"&VLOOKUP($B$4,tables!$X:$Z,3,FALSE)&\")\"&\" \"&$B$13,$B$7&\" (\"&VLOOKUP($B$4,tables!$X:$Z,3,FALSE)&\")\"))","v":"Ε3 19η (ΣΤ)"}]
["Κατηγορία: ","Κ14",null,null,null,null,null,null,null,null,null,null,null,null,null,null,null,null,null,"Tournament ID",null,null,null,null,null,{"$f":"VLOOKUP($B$4,tables!$X:$Z,2,FALSE)","v":294}]
{"$rows_left_out":26}
{"sheet":"ALMD","index":1,"n_rows":28,"n_cols":12,"rows_kept":28,"cut":false,"hidden":false,"merged":[[21,1,21,4]]}
[{"$f":"Setup!$B$3&\", \"&Setup!$B$7&\", \"&Setup!$B$4&\", \"&DAY(Setup!$B$8)&\"/\"&MONTH(Setup!$B$8)&\"-\"&DAY(Setup!$B$9)&\"/\"&MONTH(Setup!$B$9)&\"/\"&YEAR(Setup!$B$9)","v":"ΣΤ' ΕΝΩΣΗ, Ε3 19η, ΣΑ ΤΡΙΠΟΛΗΣ, 12/5-13/5/2018"},null,null,null,null,null,null,{"$f":"Setup!$B$6&\" /md\"","v":"Κ14 /md"},{"$f":"Setup!$B$6&\" /md\"","v":"Κ14 /md"}]
["α/α","από","Α.Μ.","Ονοματεπώνυμο","Γέννηση","Σύλλογος","βαθμοί","Τηλέφωνο","Υπογραφή","SortPts","Rnd"]
[1,null,26198,"ΛΑΜΠΡΟΠΟΥΛΟΥ ΒΑΣΙΛΙΚΗ","2004-01-05","ΑΕΚ ΤΡΙΠΟΛΗΣ",121,null,null,{"$f":"IF(D3>\" \",G3+K3,0)","v":121.00426255266308},4.262552663076266E-3,{"$f":"TRIM(IF(LEN(D3)<2,\"\",LEFT(D3,MIN(20,FIND(\" \",D3)-1))&MID(D3,FIND(\" \",D3),2)&\" (\"&LEFT(F3,12)&\")\"))","v":"ΛΑΜΠΡΟΠΟΥΛΟΥ Β (ΑΕΚ ΤΡΙΠΟΛΗΣ)"}]
[2,null,37585,"ΣΤΡΑΤΗ ΓΕΩΡΓΙΑ-ΑΝΔΡΙΑΝΑ","2005-08-18","ΑΟΑ ΠΑΤΡΩΝ",95,null,null,95.004360551519554,4.3605515195584204E-3,{"$f":"TRIM(IF(LEN(D4)<2,\"\",LEFT(D4,MIN(20,FIND(\" \",D4)-1))&MID(D4,FIND(\" \",D4),2)&\" (\"&LEFT(F4,12)&\")\"))","v":"ΣΤΡΑΤΗ Γ (ΑΟΑ ΠΑΤΡΩΝ)"}]
[3,null,37337,"ΔΕΛΗ ΜΑΡΙΑ","2004-08-26","ΡΗΓΑΣ ΑΟΑ ΑΡΓΟΛΙΔΑΣ",65.5,null,null,65.502882863068635,2.8828630686324008E-3,"ΔΕΛΗ Μ (ΡΗΓΑΣ ΑΟΑ ΑΡ)"]
[4,"alt",90169,"ΑΣΕΝΟΒΑ ΓΚΕΡΓΚΑΝΑ","2005-06-29","ΟΑ ΚΑΛΑΜΑΤΑΣ",52.1,null,null,52.101346797690589,1.346797690590734E-3,"ΑΣΕΝΟΒΑ Γ (ΟΑ ΚΑΛΑΜΑΤΑΣ)"]
{"$rows_left_out":23}
{"sheet":"MD","index":2,"n_rows":44,"n_cols":22,"rows_kept":44,"cut":false,"hidden":false,"merged":[[2,9,2,11],[0,0,0,17]]}
[{"$f":"Setup!$B$3&\", \"&Setup!$B$7&\", \"&Setup!$B$4&\", \"&DAY(Setup!$B$8)&\"/\"&MONTH(Setup!$B$8)&\"-\"&DAY(Setup!$B$9)&\"/\"&MONTH(Setup!$B$9)&\"/\"&YEAR(Setup!$B$9)","v":"ΣΤ' ΕΝΩΣΗ, Ε3 19η, ΣΑ ΤΡΙΠΟΛΗΣ, 12/5-13/5/2018"},null,null,null,null,null,null,null,null,null,null,null,null,null,null,null,null,null,null,null,{"$f":"Setup!B6","v":"Κ14"},{"$f":"\"bye: \"&COUNTIF(J5:J20,\"bye\")","v":"bye: 0"}]
[null,{"$f":"Setup!$B$18","v":0},null,null,null,null,null,null,{"$f":"\"αλλαγές: \"&TEXT(HOUR(NOW()),\"00\")&\":\"&TEXT(MINUTE(NOW()),\"00\")&\", \"&DAY(TODAY())&\"/\"&MONTH(TODAY())&\"/\"&YEAR(TODAY())","v":"αλλαγές: 18:18, 23/5/2018"}]
[null,null,null,null,null,null,null,null,null,16,null,null,null,null,8,null,null,4,null,null,2]
["α/α",null,"ByeOrder","ByeSum","ByeCnt","από","seed","Pts","Α.Μ.","Ονοματεπώνυμο","επώνυμο","Σύλλογος"]
[1,1,null,null,0,{"$f":"IF(NOT($G5=\"-\"),VLOOKUP($G5,ALMD!$A$3:$H$18,2,FALSE),\"\")","v":0},{"$f":"VLOOKUP($B5,Setup!$G$12:$H$27,2,FALSE)","v":1},{"$f":"IF($G5>0,VLOOKUP($G5,ALMD!$A$3:$H$18,7,FALSE),0)","v":121},{"$f":"IF(Setup!$B$24=\"\",0,IF($G5>0,VLOOKUP($G5,ALMD!$A$3:$H$18,3,FALSE),0))","v":26198},{"$f":"IF($I5>0,VLOOKUP($I5,ALMD!$C$3:$H$18,2,FALSE),\"bye\")","v":"ΛΑΜΠΡΟΠΟΥΛΟΥ ΒΑΣΙΛΙΚΗ"},{"$f":"IF(NOT(I5>0),\"\",LEFT(J5,MIN(15,FIND(\" \",J5)-1))&MID(J5,FIND(\" \",J5),2))","v":"ΛΑΜΠΡΟΠΟΥΛΟΥ Β"},{"$f":"IF($I5>0,VLOOKUP($I5,ALMD!$C$3:$H$18,4,FALSE),\"\")","v":"ΑΕΚ ΤΡΙΠΟΛΗΣ"},1,{"$f":"IF(OR(M5=1,M5=2),IF(M5=1,I5,I6),\"\")","v":26198},{"$f":"IF(OR(M5=1,M5=2),IF(M5=1,K5,K6),\"\")","v":"ΛΑΜΠΡΟΠΟΥΛΟΥ Β"}]
[2,{"$f":"1-D6+4","v":5},1,{"$f":"E6","v":0},{"$f":"IF($B$2>=C6,1,0)","v":0},{"$f":"IF(NOT($G6=\"-\"),VLOOKUP($G6,ALMD!$A$3:$H$18,2,FALSE),\"\")","v":0},{"$f":"IF($B$2>=C6,\"-\",VLOOKUP($B6,Setup!$G$12:$H$27,2,FALSE))","v":14},{"$f":"IF(NOT($G6=\"-\"),VLOOKUP($G6,ALMD!$A$3:$H$18,7,FALSE),0)","v":4.5},{"$f":"IF(Setup!$B$24=\"\",0,IF(NOT($G6=\"-\"),VLOOKUP($G6,ALMD!$A$3:$H$18,3,FALSE),0))","v":40747},{"$f":"IF($I6>0,VLOOKUP($I6,ALMD!$C$3:$H$18,2,FALSE),\"bye\")","v":"ΤΟΥΜΠΑΝΙΑΡΗ ΜΑΡΙΑ"},{"$f":"IF(NOT(I6>0),\"\",LEFT(J6,MIN(15,FIND(\" \",J6)-1))&MID(J6,FIND(\" \",J6),2))","v":"ΤΟΥΜΠΑΝΙΑΡΗ Μ"},{"$f":"IF($I6>0,VLOOKUP($I6,ALMD!$C$3:$H$18,4,FALSE),\"\")","v":"ΟΑ ΚΟΡΙΝΘΟΥ"},null,null,"40 40",1,{"$f":"IF(OR(P6=1,P6=2),IF(P6=1,N5,N7),\"\")","v":26198},{"$f":"IF(OR(P6=1,P6=2),IF(OR(AND(O6=\"\",I5>0,I6>0),AND(O8=\"\",I7>0,I8>0)),\"* αποτέλεσμα! *\",IF(P6=1,O5,O7)),\"\")","v":"ΛΑΜΠΡΟΠΟΥΛΟΥ Β"}]
{"$rows_left_out":39}
{"sheet":"OoP","index":3,"n_rows":30,"n_cols":6,"rows_kept":30,"cut":false,"hidden":false,"merged":[]}
["ΣΤ' ΕΝΩΣΗ, Ε3 19η, ΣΑ ΤΡΙΠΟΛΗΣ, 12/5-13/5 (Κ14)"]
["ΚΑΛΟΓΡΗ Σ"]
[null,null,"Πρόγραμμα αγώνων"]
[]
[null,null,"Round 16",null,null,"info"]
["ΩΡΑ","Κτγρ.","Αθλητής-Σύλλογος",null,"Αθλητής-Σύλλογος"]
{"$rows_left_out":25}
{"sheet":"PrepOP","index":4,"n_rows":30,"n_cols":6,"rows_kept":30,"cut":false,"hidden":true,"merged":[]}
[{"$f":"Setup!$B$3&\", \"&Setup!$B$7&\", \"&Setup!$B$4&\", \"&DAY(Setup!$B$8)&\"/\"&MONTH(Setup!$B$8)&\"-\"&DAY(Setup!$B$9)&\"/\"&MONTH(Setup!$B$9)& \" (\" & Setup!B6 & \")\"","v":"ΣΤ' ΕΝΩΣΗ, Ε3 19η, ΣΑ ΤΡΙΠΟΛΗΣ, 12/5-13/5 (Κ14)"}]
[{"$f":"Setup!$B$11","v":"ΚΑΛΟΓΡΗ Σ"}]
[null,null,"Πρόγραμμα αγώνων"]
[]
[null,null,"Round 16",null,null,"info"]
["ΩΡΑ","Κτγρ.","Αθλητής-Σύλλογος",null,"Αθλητής-Σύλλογος"]
{"$rows_left_out":25}
{"sheet":"tables","index":5,"n_rows":511,"n_cols":46,"rows_kept":511,"cut":false,"hidden":true,"merged":[]}
["RndIndx","random","FixRandom",null,null,null,"33-64","17-32","9-16","5-8","3-4","2ος","1ος",null,null,"Categories","Juniors","Serniors",null,null,null,"Tours",null,"Clubs","Id","Union",null,"Organizers",null,"Referees",null,"key","pts18",null,"KEY TourDetails","Date","TourName","CLUBid","CLUB","TYPE","GRP","GRPid","TDid",null,"Group","GroupID"]
[1,{"$f":"RAND()/222","v":2.4559059480094587E-3},4.262552663076266E-3,null,null,"Ε1-12",null,5,7.5,10,15,25,30,null,null,null,"Α10","m35",null,null,null,"Παν",null,null,null,null,null,null,null,null,null,"Ε1S-12-1st",30,null,{"$f":"AJ2&AK2&AL2&AN2&AO2","v":"43113Ε3 2η (Β)152Sα12"},"2018-01-13","Ε3 2η (Β)",152,"ΟΑ ΚΑΛΑΜΑΡΙΑΣ","S","α12",5,3305,null,"Α10",3]
[2,{"$f":"RAND()/222","v":3.2035634551897951E-3},4.3605515195584204E-3,null,null,"Ε1-14",null,10,15,20,30,50,60,null,null,"Α12","Α12","m40",null,null,null,"Ε3",null,"ΑΑ ΑΙΓΑΛΕΩ",366,"Θ",null,"ΕΦΟΑ",null,"Θα-ανακοινωθεί",null,"Ε1S-12-2nd",25,null,{"$f":"AJ3&AK3&AL3&AN3&AO3","v":"43113Ε3 2η (Β)152Sα16"},"2018-01-13","Ε3 2η (Β)",152,"ΟΑ ΚΑΛΑΜΑΡΙΑΣ","S","α16",7,3306,null,"Κ10",4]
[3,{"$f":"RAND()/222","v":6.1931344018901612E-4},2.8828630686324008E-3,null,null,"Ε1-16",null,20,30,40,60,100,120,null,null,"Α14","Α14","m45",null,null,null,"Ε4",null,"ΑΑ ΑΛΜΠΑΤΡΟΣ",124,"Β",null,"Α' ΕΝΩΣΗ",null,"ΑΛΕΞΙΟΥ Δ",null,"Ε1S-12-3_4",15,null,"43113Ε3 2η (Β)152Sκ12","2018-01-13","Ε3 2η (Β)",152,"ΟΑ ΚΑΛΑΜΑΡΙΑΣ","S","κ12",9,3307,null,"Α12",5]
[4,{"$f":"RAND()/222","v":1.6432032500026752E-3},1.346797690590734E-3,null,null,"Ε1-18",null,25,37.5,50,75,125,150,null,null,"Α16","Α16","m50",null,null,null,"Open",null,"ΑΑ ΚΕΡΚΥΡΑΣ",201,"Δ",null,"Β' ΕΝΩΣΗ",null,"ΑΜΟΥΤΖΟΓΛΟΥ Κ",null,"Ε1S-12-5_8",10,null,"43113Ε3 2η (Β)152Sκ16","2018-01-13","Ε3 2η (Β)",152,"ΟΑ ΚΑΛΑΜΑΡΙΑΣ","S","κ16",11,3308,null,"Α14",6]
[5,{"$f":"RAND()/222","v":4.1373892141346111E-3},1.0143343628999575E-3,null,null,"Ε2-12",null,2.5,4,5,7.5,12.5,15,null,null,"Α18","Α18","m55",null,null,null,"ΠανΑΓ",null,"ΑΑ ΝΑΟΥΣΑΣ",169,"Γ",null,"Γ' ΕΝΩΣΗ",null,"ΑΞΑΡΛΗ Ν",null,"Ε1S-12-9_16",7.5,null,"43120Ε3 4η (Δ)217Sα12","2018-01-20","Ε3 4η (Δ)",217,"ΟΑ ΑΡΤΑΣ","S","α12",5,3309,null,"Α16",7]
{"$rows_left_out":506}
{"sheet":"matches","index":6,"n_rows":17,"n_cols":19,"rows_kept":17,"cut":false,"hidden":true,"merged":[]}
["round","W-ID","winner","L-ID","looser","score",null," Player "," Position ",null,"Set-up",null,null,"draw#","organizer","club","title","category","drawSize"]
[16,{"$f":"IF(OR(MD!$M$5=1,MD!$M$5=2), IF(MD!$M$5=1,MD!$I$5,MD!$I$6),\"#\")","v":26198},{"$f":"TRIM(LEFT(VLOOKUP(B2,ALMD!$C$3:$D$18,2,FALSE),FIND(\" \",VLOOKUP(B2,ALMD!$C$3:$D$18,2,FALSE),1)-1))","v":"ΛΑΜΠΡΟΠΟΥΛΟΥ"},{"$f":"IF(OR(MD!$M$5 =1,MD!$M$5 =2), IF(MD!$M$5 =2,MD!$I$5,MD!$I$6),\"#\")","v":40747},{"$f":"TRIM(LEFT(VLOOKUP(D2,ALMD!$C$3:$D$18,2,FALSE),FIND(\" \",VLOOKUP(D2,ALMD!$C$3:$D$18,2,FALSE),1)-1))","v":"ΤΟΥΜΠΑΝΙΑΡΗ"},{"$f":"MD!$O6","v":"40 40"},null,{"$f":"B16","v":26198},"1st",null,"organizer: ",{"$f":"Setup!$B$3","v":"ΣΤ' ΕΝΩΣΗ"},null,{"$f":"IF(COUNTIF(MD!$I:$I,B2)>0,MATCH(B2,MD!$I:$I,0)-4,\"\")&\" \"&IF(COUNTIF(MD!$I:$I,D2)>0,MATCH(D2,MD!$I:$I,0)-4,\"\")","v":"1 2"},{"$f":"Setup!$B$3","v":"ΣΤ' ΕΝΩΣΗ"},{"$f":"TRIM(LEFT($L$4,10))","v":"ΣΑ ΤΡΙΠΟΛΗ"},{"$f":"TRIM(LEFT($L$3,10))","v":"Ε3 19η"},{"$f":"SUBSTITUTE(SUBSTITUTE(TRIM($L$7),\"Κ\",\"g\"),\"Α\",\"b\")","v":"g14"},16]
[16,{"$f":"IF(OR(MD!$M$7=1,MD!$M$7=2), IF(MD!$M$7=1,MD!$I$7,MD!$I$8),\"#\")","v":35659},{"$f":"TRIM(LEFT(VLOOKUP(B3,ALMD!$C$3:$D$18,2,FALSE),FIND(\" \",VLOOKUP(B3,ALMD!$C$3:$D$18,2,FALSE),1)-1))","v":"ΜΑΚΡΥΓΕΩΡΓΟΥ"},{"$f":"IF(OR(MD!$M$7 =1,MD!$M$7 =2), IF(MD!$M$7 =2,MD!$I$7,MD!$I$8),\"#\")","v":41973},{"$f":"TRIM(LEFT(VLOOKUP(D3,ALMD!$C$3:$D$18,2,FALSE),FIND(\" \",VLOOKUP(D3,ALMD!$C$3:$D$18,2,FALSE),1)-1))","v":"ΣΑΚΚΕΛΑΡΟΠΟΥΛΟΥ"},{"$f":"MD!$O8","v":"40 41"},null,{"$f":"D16","v":37585},"2nd",null,"title: ",{"$f":"Setup!$B$7","v":"Ε3 19η"},null,{"$f":"IF(COUNTIF(MD!$I:$I,B3)>0,MATCH(B3,MD!$I:$I,0)-4,\"\")&\" \"&IF(COUNTIF(MD!$I:$I,D3)>0,MATCH(D3,MD!$I:$I,0)-4,\"\")","v":"4 3"},{"$f":"Setup!$B$3","v":"ΣΤ' ΕΝΩΣΗ"},{"$f":"TRIM(LEFT($L$4,10))","v":"ΣΑ ΤΡΙΠΟΛΗ"},{"$f":"TRIM(LEFT($L$3,10))","v":"Ε3 19η"},{"$f":"SUBSTITUTE(SUBSTITUTE(TRIM($L$7),\"Κ\",\"g\"),\"Α\",\"b\")","v":"g14"},16]
[16,{"$f":"IF(OR(MD!$M$9=1,MD!$M$9=2), IF(MD!$M$9=1,MD!$I$9,MD!$I$10),\"#\")","v":90169},{"$f":"TRIM(LEFT(VLOOKUP(B4,ALMD!$C$3:$D$18,2,FALSE),FIND(\" \",VLOOKUP(B4,ALMD!$C$3:$D$18,2,FALSE),1)-1))","v":"ΑΣΕΝΟΒΑ"},{"$f":"IF(OR(MD!$M$9 =1,MD!$M$9 =2), IF(MD!$M$9 =2,MD!$I$9,MD!$I$10),\"#\")","v":36781},{"$f":"TRIM(LEFT(VLOOKUP(D4,ALMD!$C$3:$D$18,2,FALSE),FIND(\" \",VLOOKUP(D4,ALMD!$C$3:$D$18,2,FALSE),1)-1))","v":"ΚΟΚΚΙΝΟΥ"},{"$f":"MD!$O10","v":"41 40"},null,{"$f":"D14","v":90169},"3_4",null,"club: ",{"$f":"Setup!$B$4","v":"ΣΑ ΤΡΙΠΟΛΗΣ"},null,{"$f":"IF(COUNTIF(MD!$I:$I,B4)>0,MATCH(B4,MD!$I:$I,0)-4,\"\")&\" \"&IF(COUNTIF(MD!$I:$I,D4)>0,MATCH(D4,MD!$I:$I,0)-4,\"\")","v":"5 6"},{"$f":"Setup!$B$3","v":"ΣΤ' ΕΝΩΣΗ"},"ΣΑ ΤΡΙΠΟΛΗ","Ε3 19η","g14",16]
[16,{"$f":"IF(OR(MD!$M$11=1,MD!$M$11=2), IF(MD!$M$11=1,MD!$I$11,MD!$I$12),\"#\")","v":34396},{"$f":"TRIM(LEFT(VLOOKUP(B5,ALMD!$C$3:$D$18,2,FALSE),FIND(\" \",VLOOKUP(B5,ALMD!$C$3:$D$18,2,FALSE),1)-1))","v":"ΜΗΤΡΟΠΟΥΛΟΥ"},{"$f":"IF(OR(MD!$M$11=1,MD!$M$11=2), IF(MD!$M$11=2,MD!$I$11,MD!$I$12),\"#\")","v":38845},{"$f":"TRIM(LEFT(VLOOKUP(D5,ALMD!$C$3:$D$18,2,FALSE),FIND(\" \",VLOOKUP(D5,ALMD!$C$3:$D$18,2,FALSE),1)-1))","v":"ΤΣΙΛΙΜΠΗ"},{"$f":"MD!$O12","v":"41 53"},null,{"$f":"D15","v":38948},"3_4",null,"grade: ",{"$f":"Setup!$B$5","v":"Ε3"},null,{"$f":"IF(COUNTIF(MD!$I:$I,B5)>0,MATCH(B5,MD!$I:$I,0)-4,\"\")&\" \"&IF(COUNTIF(MD!$I:$I,D5)>0,MATCH(D5,MD!$I:$I,0)-4,\"\")","v":"7 8"},{"$f":"Setup!$B$3","v":"ΣΤ' ΕΝΩΣΗ"},"ΣΑ ΤΡΙΠΟΛΗ","Ε3 19η","g14",16]
[16,{"$f":"IF(OR(MD!$M$13=1,MD!$M$13=2), IF(MD!$M$13=1,MD!$I$13,MD!$I$14),\"#\")","v":38948},{"$f":"TRIM(LEFT(VLOOKUP(B6,ALMD!$C$3:$D$18,2,FALSE),FIND(\" \",VLOOKUP(B6,ALMD!$C$3:$D$18,2,FALSE),1)-1))","v":"ΠΑΠΑΚΩΝΣΤΑΝΤΙΝΟΥ"},{"$f":"IF(OR(MD!$M$13=1,MD!$M$13=2), IF(MD!$M$13=2,MD!$I$13,MD!$I$14),\"#\")","v":37337},{"$f":"TRIM(LEFT(VLOOKUP(D6,ALMD!$C$3:$D$18,2,FALSE),FIND(\" \",VLOOKUP(D6,ALMD!$C$3:$D$18,2,FALSE),1)-1))","v":"ΔΕΛΗ"},{"$f":"MD!$O14","v":"54(1) 40"},null,{"$f":"D10","v":35659},"5_8",null,"week: ",{"$f":"Setup!B10","v":"βδ.: 19η"},null,{"$f":"IF(COUNTIF(MD!$I:$I,B6)>0,MATCH(B6,MD!$I:$I,0)-4,\"\")&\" \"&IF(COUNTIF(MD!$I:$I,D6)>0,MATCH(D6,MD!$I:$I,0)-4,\"\")","v":"10 9"},{"$f":"Setup!$B$3","v":"ΣΤ' ΕΝΩΣΗ"},"ΣΑ ΤΡΙΠΟΛΗ","Ε3 19η","g14",16]
{"$rows_left_out":12}
{"sheet":"e-efoa","index":7,"n_rows":17,"n_cols":41,"rows_kept":17,"cut":false,"hidden":true,"merged":[]}
["organizer","club","title","group","Dsize","MStartDate","TournamentDetailsId","round","WPlayerCode","LPlayerCode","Score","WRow","LRow","WSeed","LSeed","W","L","n/m",null,"seed","cmnt","TournamentDetailsId"," PlayerCode","Round","Wins","Matches","PtsQ","PtsM","Age",null,"ID","name","row","seed",null,"RankKey",null,"MatcheNames","key","PlayerName 1","PlayerName 2"]
[{"$f":"Setup!$B$3","v":"ΣΤ' ΕΝΩΣΗ"},{"$f":"Setup!$Z$6","v":294},{"$f":"Setup!$Z$5","v":"Ε3 19η (ΣΤ)"},{"$f":"SUBSTITUTE(TRIM(Setup!$B$6),\"-\",\"\")","v":"Κ14"},"Smd16",{"$f":"TEXT(Setup!$B$8,\"ΕΕΕΕ-ΜΜ-ΗΗ\")","v":"2018-05-12"},{"$f":"Setup!$T$7","v":{"$error":"#N/A"}},"R16",{"$f":"IF(OR(MD!$M$5=1,MD!$M$5=2), IF(MD!$M$5=1,MD!$I$5,MD!$I$6),\"\")","v":26198},{"$f":"IF(OR(MD!$M$5 =1,MD!$M$5 =2), IF(MD!$M$5 =2,MD!$I$5,MD!$I$6),\"\")","v":40747},{"$f":"TRIM(MD!$O6)","v":"40 40"},{"$f":"IF(AND(I2<>\"\",I2>0),IF(VALUE(I2)>0,VLOOKUP(I2,$AE:$AH,3,FALSE),0),0)","v":1},{"$f":"IF(AND(J2<>\"\",J2>0),IF(VALUE(J2)>0,VLOOKUP(J2,$AE:$AH,3,FALSE),0),0)","v":2},{"$f":"IF(AND(I2<>\"\",I2>0),IF(VALUE(I2)>0,VLOOKUP(I2,$AE:$AH,4,FALSE),0),0)","v":1},{"$f":"IF(AND(J2<>\"\",J2>0),IF(VALUE(J2)>0,VLOOKUP(J2,$AE:$AH,4,FALSE),0),0)","v":14},{"$f":"IF(R2=\"\",I2,\"\")","v":26198},{"$f":"IF(R2=\"\",J2,\"\")","v":40747},{"$f":"IF(OR(J2=0,K2=\"\"),1,IF(TEXT(K2,\"0\")=SUBSTITUTE(LOWER(K2),\"m\",\"\"),\"\",1))","v":""},null,{"$f":"IF(W2<>\"\",IF(VALUE(W2)>0,VLOOKUP(W2,$AE:$AH,4,FALSE),\"\"),\"\")","v":1},{"$f":"IF(NOT(OR(W2=0,W2=\" \",W2=\"\")),IF(INDIRECT(\"ALMD!B\"&MATCH(W2,ALMD!$C$3:$C$18,0)+2)>0,INDIRECT(\"ALMD!B\"&MATCH(W2,ALMD!$C$3:$C$18,0)+2),\"\"),\"\")","v":""},{"$f":"Setup!$T$7","v":{"$error":"#N/A"}},{"$f":"I16","v":26198},"1st",{"$f":"IF($W2>0,COUNTIF($P$2:$P$16,$W2),0)","v":4},{"$f":"IF($W2>0,COUNTIF($P$2:$P$16,$W2)+COUNTIF($Q$2:$Q$16,$W2),0)","v":4},0,{"$f":"IF(OR($Z2=0,$Z2=\"\",$U2=\"DQ\"),0,VLOOKUP($AJ2,tables!$AF:$AG,2,FALSE))","v":18},{"$f":"IF(W2>0,YEAR(Setup!$B$8)-YEAR(VLOOKUP(W2,ALMD!$C:$F,3,FALSE)),0)","v":14},null,{"$f":"MD!$I5","v":26198},{"$f":"MD!$K5","v":"ΛΑΜΠΡΟΠΟΥΛΟΥ Β"},{"$f":"IF(AE2>0,MD!$A5,\"\")","v":1},{"$f":"MD!$G5","v":1},null,{"$f":"SUBSTITUTE(SUBSTITUTE(Setup!$B$5&\"S-\"&Setup!$B$13&\"-\"&X2,\"Ανδ-\",\"\"),\"Γυν-\",\"\")","v":"Ε3S-14-1st"},null,{"$f":"IF(AO2>\" \", IF(OR(AM2=AM3,AM2=AM1), IF(AM2=AM3,AN2&\"/\"&AN3&\" - \"&AO2&\"/\"&AO3, AN1&\"/\"&AN2&\" - \"&AO1&\"/\"&AO2),AN2&\" - \"&AO2), IF(OR(AM2=AM3,AM2=AM1), IF(AM2=AM3,AN2&\"/\"&AN3, AN1&\"/\"&AN2),AN2))","v":{"$error":"#N/A"}},{"$f":"G2&H2&L2","v":{"$error":"#N/A"}},{"$f":"IF(I2<=0,\"\",TRIM(LEFT(LEFT(VLOOKUP(I2,$AE:$AF,2,FALSE),FIND(\" \",VLOOKUP(I2,$AE:$AF,2,FALSE),1)-1),15)&\" \"&LEFT(MID(VLOOKUP(I2,$AE:$AF,2,FALSE),FIND(\" \",VLOOKUP(I2,$AE:$AF,2,FALSE),1)+1,20),3)))","v":"ΛΑΜΠΡΟΠΟΥΛΟΥ Β"},{"$f":"IF(J2<=0,\"\",TRIM(LEFT(LEFT(VLOOKUP(J2,$AE:$AF,2,FALSE),FIND(\" \",VLOOKUP(J2,$AE:$AF,2,FALSE),1)-1),15)&\" \"&LEFT(MID(VLOOKUP(J2,$AE:$AF,2,FALSE),FIND(\" \",VLOOKUP(J2,$AE:$AF,2,FALSE),1)+1,20),3)))","v":"ΤΟΥΜΠΑΝΙΑΡΗ Μ"}]
[{"$f":"Setup!$B$3","v":"ΣΤ' ΕΝΩΣΗ"},{"$f":"Setup!$Z$6","v":294},{"$f":"Setup!$Z$5","v":"Ε3 19η (ΣΤ)"},{"$f":"SUBSTITUTE(TRIM(Setup!$B$6),\"-\",\"\")","v":"Κ14"},"Smd16",{"$f":"TEXT(Setup!$B$8,\"ΕΕΕΕ-ΜΜ-ΗΗ\")","v":"2018-05-12"},{"$f":"Setup!$T$7","v":{"$error":"#N/A"}},"R16",{"$f":"IF(OR(MD!$M$7=1,MD!$M$7=2), IF(MD!$M$7=1,MD!$I$7,MD!$I$8),\"\")","v":35659},{"$f":"IF(OR(MD!$M$7 =1,MD!$M$7 =2), IF(MD!$M$7 =2,MD!$I$7,MD!$I$8),\"\")","v":41973},{"$f":"TRIM(MD!$O8)","v":"40 41"},4,3,7,15,{"$f":"IF(R3=\"\",I3,\"\")","v":35659},{"$f":"IF(R3=\"\",J3,\"\")","v":41973},{"$f":"IF(OR(J3=0,K3=\"\"),1,IF(TEXT(K3,\"0\")=SUBSTITUTE(LOWER(K3),\"m\",\"\"),\"\",1))","v":""},null,2,{"$f":"IF(NOT(OR(W3=0,W3=\" \",W3=\"\")),IF(INDIRECT(\"ALMD!B\"&MATCH(W3,ALMD!$C$3:$C$18,0)+2)>0,INDIRECT(\"ALMD!B\"&MATCH(W3,ALMD!$C$3:$C$18,0)+2),\"\"),\"\")","v":""},{"$f":"Setup!$T$7","v":{"$error":"#N/A"}},{"$f":"J16","v":37585},"2nd",{"$f":"IF($W3>0,COUNTIF($P$2:$P$16,$W3),0)","v":3},{"$f":"IF($W3>0,COUNTIF($P$2:$P$16,$W3)+COUNTIF($Q$2:$Q$16,$W3),0)","v":4},0,{"$f":"IF(OR($Z3=0,$Z3=\"\",$U3=\"DQ\"),0,VLOOKUP($AJ3,tables!$AF:$AG,2,FALSE))","v":15},{"$f":"IF(W3>0,YEAR(Setup!$B$8)-YEAR(VLOOKUP(W3,ALMD!$C:$F,3,FALSE)),0)","v":13},null,{"$f":"MD!$I6","v":40747},{"$f":"MD!$K6","v":"ΤΟΥΜΠΑΝΙΑΡΗ Μ"},{"$f":"IF(AE3>0,MD!$A6,\"\")","v":2},{"$f":"MD!$G6","v":14},null,{"$f":"SUBSTITUTE(SUBSTITUTE(Setup!$B$5&\"S-\"&Setup!$B$13&\"-\"&X3,\"Ανδ-\",\"\"),\"Γυν-\",\"\")","v":"Ε3S-14-2nd"},null,{"$error":"#N/A"},{"$error":"#N/A"},"ΜΑΚΡΥΓΕΩΡΓΟΥ Χ","ΣΑΚΚΕΛΑΡΟΠΟΥΛΟΥ Ε"]
[{"$f":"Setup!$B$3","v":"ΣΤ' ΕΝΩΣΗ"},{"$f":"Setup!$Z$6","v":294},{"$f":"Setup!$Z$5","v":"Ε3 19η (ΣΤ)"},{"$f":"SUBSTITUTE(TRIM(Setup!$B$6),\"-\",\"\")","v":"Κ14"},"Smd16",{"$f":"TEXT(Setup!$B$8,\"ΕΕΕΕ-ΜΜ-ΗΗ\")","v":"2018-05-12"},{"$f":"Setup!$T$7","v":{"$error":"#N/A"}},"R16",{"$f":"IF(OR(MD!$M$9=1,MD!$M$9=2), IF(MD!$M$9=1,MD!$I$9,MD!$I$10),\"\")","v":90169},{"$f":"IF(OR(MD!$M$9 =1,MD!$M$9 =2), IF(MD!$M$9 =2,MD!$I$9,MD!$I$10),\"\")","v":36781},{"$f":"TRIM(MD!$O10)","v":"41 40"},5,6,4,9,90169,36781,"",null,4,{"$f":"IF(NOT(OR(W4=0,W4=\" \",W4=\"\")),IF(INDIRECT(\"ALMD!B\"&MATCH(W4,ALMD!$C$3:$C$18,0)+2)>0,INDIRECT(\"ALMD!B\"&MATCH(W4,ALMD!$C$3:$C$18,0)+2),\"\"),\"\")","v":"alt"},{"$f":"Setup!$T$7","v":{"$error":"#N/A"}},{"$f":"J14","v":90169},"3_4",2,3,0,{"$f":"IF(OR($Z4=0,$Z4=\"\",$U4=\"DQ\"),0,VLOOKUP($AJ4,tables!$AF:$AG,2,FALSE))","v":9},{"$f":"IF(W4>0,YEAR(Setup!$B$8)-YEAR(VLOOKUP(W4,ALMD!$C:$F,3,FALSE)),0)","v":13},null,{"$f":"MD!$I7","v":41973},{"$f":"MD!$K7","v":"ΣΑΚΚΕΛΑΡΟΠΟΥΛΟΥ Ε"},{"$f":"IF(AE4>0,MD!$A7,\"\")","v":3},{"$f":"MD!$G7","v":15},null,{"$f":"SUBSTITUTE(SUBSTITUTE(Setup!$B$5&\"S-\"&Setup!$B$13&\"-\"&X4,\"Ανδ-\",\"\"),\"Γυν-\",\"\")","v":"Ε3S-14-3_4"},null,{"$error":"#N/A"},{"$error":"#N/A"},"ΑΣΕΝΟΒΑ Γ","ΚΟΚΚΙΝΟΥ Α"]
[{"$f":"Setup!$B$3","v":"ΣΤ' ΕΝΩΣΗ"},{"$f":"Setup!$Z$6","v":294},{"$f":"Setup!$Z$5","v":"Ε3 19η (ΣΤ)"},{"$f":"SUBSTITUTE(TRIM(Setup!$B$6),\"-\",\"\")","v":"Κ14"},"Smd16",{"$f":"TEXT(Setup!$B$8,\"ΕΕΕΕ-ΜΜ-ΗΗ\")","v":"2018-05-12"},{"$f":"Setup!$T$7","v":{"$error":"#N/A"}},"R16",{"$f":"IF(OR(MD!$M$11=1,MD!$M$11=2), IF(MD!$M$11=1,MD!$I$11,MD!$I$12),\"\")","v":34396},{"$f":"IF(OR(MD!$M$11=1,MD!$M$11=2), IF(MD!$M$11=2,MD!$I$11,MD!$I$12),\"\")","v":38845},{"$f":"TRIM(MD!$O12)","v":"41 53"},7,8,12,10,34396,38845,"",null,6,{"$f":"IF(NOT(OR(W5=0,W5=\" \",W5=\"\")),IF(INDIRECT(\"ALMD!B\"&MATCH(W5,ALMD!$C$3:$C$18,0)+2)>0,INDIRECT(\"ALMD!B\"&MATCH(W5,ALMD!$C$3:$C$18,0)+2),\"\"),\"\")","v":"alt"},{"$f":"Setup!$T$7","v":{"$error":"#N/A"}},{"$f":"J15","v":38948},"3_4",2,3,0,{"$f":"IF(OR($Z5=0,$Z5=\"\",$U5=\"DQ\"),0,VLOOKUP($AJ5,tables!$AF:$AG,2,FALSE))","v":9},{"$f":"IF(W5>0,YEAR(Setup!$B$8)-YEAR(VLOOKUP(W5,ALMD!$C:$F,3,FALSE)),0)","v":12},null,{"$f":"MD!$I8","v":35659},{"$f":"MD!$K8","v":"ΜΑΚΡΥΓΕΩΡΓΟΥ Χ"},{"$f":"IF(AE5>0,MD!$A8,\"\")","v":4},{"$f":"MD!$G8","v":7},null,{"$f":"SUBSTITUTE(SUBSTITUTE(Setup!$B$5&\"S-\"&Setup!$B$13&\"-\"&X5,\"Ανδ-\",\"\"),\"Γυν-\",\"\")","v":"Ε3S-14-3_4"},null,{"$error":"#N/A"},{"$error":"#N/A"},"ΜΗΤΡΟΠΟΥΛΟΥ Α","ΤΣΙΛΙΜΠΗ Δ"]
[{"$f":"Setup!$B$3","v":"ΣΤ' ΕΝΩΣΗ"},{"$f":"Setup!$Z$6","v":294},{"$f":"Setup!$Z$5","v":"Ε3 19η (ΣΤ)"},{"$f":"SUBSTITUTE(TRIM(Setup!$B$6),\"-\",\"\")","v":"Κ14"},"Smd16",{"$f":"TEXT(Setup!$B$8,\"ΕΕΕΕ-ΜΜ-ΗΗ\")","v":"2018-05-12"},{"$f":"Setup!$T$7","v":{"$error":"#N/A"}},"R16",{"$f":"IF(OR(MD!$M$13=1,MD!$M$13=2), IF(MD!$M$13=1,MD!$I$13,MD!$I$14),\"\")","v":38948},{"$f":"IF(OR(MD!$M$13=1,MD!$M$13=2), IF(MD!$M$13=2,MD!$I$13,MD!$I$14),\"\")","v":37337},{"$f":"TRIM(MD!$O14)","v":"54(1) 40"},10,9,6,3,38948,37337,"",null,7,{"$f":"IF(NOT(OR(W6=0,W6=\" \",W6=\"\")),IF(INDIRECT(\"ALMD!B\"&MATCH(W6,ALMD!$C$3:$C$18,0)+2)>0,INDIRECT(\"ALMD!B\"&MATCH(W6,ALMD!$C$3:$C$18,0)+2),\"\"),\"\")","v":""},{"$f":"Setup!$T$7","v":{"$error":"#N/A"}},{"$f":"J10","v":35659},"5_8",1,2,0,{"$f":"IF(OR($Z6=0,$Z6=\"\",$U6=\"DQ\"),0,VLOOKUP($AJ6,tables!$AF:$AG,2,FALSE))","v":6},{"$f":"IF(W6>0,YEAR(Setup!$B$8)-YEAR(VLOOKUP(W6,ALMD!$C:$F,3,FALSE)),0)","v":13},null,{"$f":"MD!$I9","v":90169},{"$f":"MD!$K9","v":"ΑΣΕΝΟΒΑ Γ"},{"$f":"IF(AE6>0,MD!$A9,\"\")","v":5},{"$f":"MD!$G9","v":4},null,{"$f":"IF(AND(OR(Y6=0,Y6=\"\"), Setup!$B$17>\"\"), Setup!$B$5&\"S-\"&Setup!$B$13&\"-\"&Setup!$B$17, Setup!$B$5&\"S-\"&Setup!$B$13&\"-\"&X6)","v":"Ε3S-14-5_8"},null,{"$error":"#N/A"},{"$error":"#N/A"},"ΠΑΠΑΚΩΝΣΤΑΝΤΙΝΟ Μ","ΔΕΛΗ Μ"]
{"$rows_left_out":11}