{"text_format":"1","workbook":"xlsx","n_sheets":8,"sheets":["Setup","MD","OoP","ALMD","PrepOP","tables","matches","e-efoa"],"not_rendered":{"charts":0,"images":0,"macros":1,"external_links":0,"defined_names":11,"comments":0,"pivot_tables":0},"unopened":[],"bounds":{"document_bytes":16777216,"sheet_cells":100000,"rows_first":2000,"rows_last":500,"rows_between":2000,"halvings":0,"cell_chars":16384,"cell_head_chars":4096},"cells_cut":0,"cells_raw":0,"read":"whole","date_system":"1900"}

{"sheet":"Setup","index":0,"n_rows":34,"n_cols":26,"rows_kept":34,"cut":false,"hidden":false,"merged":[[1,3,2,3],[4,3,7,3],[10,19,11,19],[15,19,15,20],[16,19,16,20]]}
["Singles",32,null,"Θέσεις","seed",null,null,0,"seed","space pos","Index","Value"]
["Draw32_S",null,null,"3-4",{"$f":"VALUE(LEFT(F2,1))","v":3},"3 4",null,{"$f":"IF(I2=\"-\",\"-\",IF(I2>0,H1+1,0))","v":0},{"$f":"IF(J2>0,VALUE(MID($A$32,1,J2-1)),\"-\")","v":0},{"$f":"IF(LEN($A$32)>1,FIND(\" \",$A$32,1),0)","v":2},0,0]
["Διοργανωτής: ","ΣΤ' ΕΝΩΣΗ",null,null,{"$f":"VALUE(RIGHT(F2,1))","v":4},null,null,0,{"$f":"IF(J3>0,VALUE(MID($A$32,J2+1,J3-J2-1)),\"-\")","v":0},{"$f":"IF(AND(J2>0,LEN($A$32)>J2+1),FIND(\" \",$A$32,J2+1),0)","v":4},0,0,null,null,null,null,null,null,null,null,null,null,null,null,null,"Tour lookup"]
["Έδρα αγώνων: ","ΣΑ ΤΡΙΠΟΛΗΣ",null,"Θέσεις","seed",null,null,0,0,6,0,0,null,null,null,null,null,null,null,null,null,null,null,null,null,{"$f":"$B$8","v":43232}]
["grade: ","Ε3",null,"5-8",{"$f":"TRIM(LEFT(F5,(FIND(\" \",F5,1)-1)))","v":"6"},"6 5 8 7",null,0,0,8,0,0,null,null,null,null,null,null,null,null,null,null,null,null,null,{"$f":"TRIM(IF(OR($B$5=\"Παν\",$B$5=\"ΠανΑΓ\",$B$5=\"Open\",$B$5=\"OpenΑΓ\"),$B$5&\" (\"&VLOOKUP($B$4,tables!$X:$Z,3,FALSE)&\")\"&\" \"&$B$13,$B$7&\" (\"&VLOOKUP($B$4,tables!$X:$Z,3,FALSE)&\")\"))","v":"Ε3 19η (ΣΤ)"}]
["Κατηγορία: ","Α14",null,null,{"$f":"TRIM(MID(F5,(FIND(\" \",F5,1)),FIND(\" \",F5,(FIND(\" \",F5,1)+1))-(FIND(\" \",F5,1))))","v":"5"},null,null,0,0,10,0,0,null,null,null,null,null,null,null,"Tournament ID",null,null,null,null,null,{"$f":"VLOOKUP($B$4,tables!$X:$Z,2,FALSE)","v":294}]
{"$rows_left_out":29}
{"sheet":"MD","index":1,"n_rows":66,"n_cols":25,"rows_kept":66,"cut":false,"hidden":false,"merged":[[0,0,0,20],[2,9,2,11],[40,20,40,23]]}
[{"$f":"Setup!$B$3&\", \"&Setup!$B$7&\", \"&Setup!$B$4&\", \"&DAY(Setup!$B$8)&\"/\"&MONTH(Setup!$B$8)&\"-\"&DAY(Setup!$B$9)&\"/\"&MONTH(Setup!$B$9)&\"/\"&YEAR(Setup!$B$9)","v":"ΣΤ' ΕΝΩΣΗ, Ε3 19η, ΣΑ ΤΡΙΠΟΛΗΣ, 12/5-13/5/2018"},null,null,null,null,null,null,null,null,null,null,null,null,null,null,null,null,null,null,null,null,null,null,{"$f":"Setup!B6","v":"Α14"},{"$f":"\"bye: \"&COUNTIF(J5:J36,\"bye\")","v":"bye: 12"}]
[null,{"$f":"Setup!B18","v":12},null,null,null,null,null,null,{"$f":"\"αλλαγές: \"&TEXT(HOUR(NOW()),\"00\")&\":\"&TEXT(MINUTE(NOW()),\"00\")&\", \"&DAY(TODAY())&\"/\"&MONTH(TODAY())&\"/\"&YEAR(TODAY())","v":"αλλαγές: 18:18, 23/5/2018"}]
[null,null,null,null,null,null,null,null,null,32,null,null,null,null,16,null,null,8,null,null,4,null,null,"2 & w"]
["α/α",null,"ByeOrder","ByeSum","ByeCnt","από","seed","Pts","Α.Μ.","Ονοματεπώνυμο","επώνυμο","Σύλλογος"]
[1,1,null,null,0,{"$f":"IF(NOT($G5=\"-\"),VLOOKUP($G5,ALMD!$A$3:$G$34,2,FALSE),\"\")","v":0},{"$f":"VLOOKUP($B5,Setup!$K$2:$L$33,2,FALSE)","v":1},{"$f":"IF($G5>0,VLOOKUP($G5,ALMD!$A$3:$G$34,7,FALSE),0)","v":122},{"$f":"IF(Setup!$B$24=\"\",0,IF($G5>0,VLOOKUP($G5,ALMD!$A$3:$G$34,3,FALSE),0))","v":34598},{"$f":"IF($I5>0,VLOOKUP($I5,ALMD!$C$3:$G$34,2,FALSE),\"bye\")","v":"ΚΟΛΛΙΑΣ ΣΤΑΥΡΟΣ"},{"$f":"IF(NOT(I5>0),\"\",LEFT(J5,MIN(15,FIND(\" \",J5)-1))&MID(J5,FIND(\" \",J5),2))","v":"ΚΟΛΛΙΑΣ Σ"},{"$f":"IF($I5>0,VLOOKUP($I5,ALMD!$C$3:$G$34,4,FALSE),\"\")","v":"ΡΗΓΑΣ ΑΟΑ ΑΡΓΟΛΙΔΑΣ"},1,{"$f":"IF((OR(M5=1,M5=2)),IF(M5=1,I5,I6),\"\")","v":34598},{"$f":"IF((OR(M5=1,M5=2)),IF(M5=1,K5,K6),\"\")","v":"ΚΟΛΛΙΑΣ Σ"}]
[2,{"$f":"1-D6+8","v":8},{"$f":"B5","v":1},{"$f":"E6","v":1},{"$f":"IF($B$2>=C6,1,0)","v":1},{"$f":"IF(NOT($G6=\"-\"),VLOOKUP($G6,ALMD!$A$3:$G$34,2,FALSE),\"\")","v":""},{"$f":"IF($B$2>=C6,\"-\",VLOOKUP($B6,Setup!$K$2:$L$33,2,FALSE))","v":"-"},{"$f":"IF(NOT($G6=\"-\"),VLOOKUP($G6,ALMD!$A$3:$G$34,7,FALSE),0)","v":0},{"$f":"IF(Setup!$B$24=\"\",0,IF(NOT($G6=\"-\"),VLOOKUP($G6,ALMD!$A$3:$G$34,3,FALSE),0))","v":0},{"$f":"IF($I6>0,VLOOKUP($I6,ALMD!$C$3:$G$34,2,FALSE),\"bye\")","v":"bye"},{"$f":"IF(NOT(I6>0),\"\",LEFT(J6,MIN(15,FIND(\" \",J6)-1))&MID(J6,FIND(\" \",J6),2))","v":""},{"$f":"IF($I6>0,VLOOKUP($I6,ALMD!$C$3:$G$34,4,FALSE),\"\")","v":""},null,null,null,1,{"$f":"IF((OR(P6=1,P6=2)),IF(P6=1,N5,N7),\"\")","v":34598},{"$f":"IF(OR(P6=1,P6=2),IF(OR(AND(O6=\"\",I5>0,I6>0),AND(O8=\"\",I7>0,I8>0)),\"* αποτέλεσμα! *\",IF(P6=1,O5,O7)),\"\")","v":"ΚΟΛΛΙΑΣ Σ"}]
{"$rows_left_out":61}
{"sheet":"OoP","index":2,"n_rows":49,"n_cols":6,"rows_kept":49,"cut":false,"hidden":false,"merged":[]}
["ΣΤ' ΕΝΩΣΗ, Ε3 19η, ΣΑ ΤΡΙΠΟΛΗΣ, 12/5-13/5 (Α14)"]
["ΚΑΛΟΓΡΗ Σ"]
[null,null,"Πρόγραμμα αγώνων"]
[]
[null,null,"Round 32",null,null,"info"]
["ΩΡΑ","Κτγρ.","Αθλητής-Σύλλογος",null,"Αθλητής-Σύλλογος"]
{"$rows_left_out":44}
{"sheet":"ALMD","index":3,"n_rows":45,"n_cols":12,"rows_kept":45,"cut":false,"hidden":false,"merged":[[37,1,37,4]]}
[{"$f":"Setup!$B$3&\", \"&Setup!$B$7&\", \"&Setup!$B$4&\", \"&DAY(Setup!$B$8)&\"/\"&MONTH(Setup!$B$8)&\"-\"&DAY(Setup!$B$9)&\"/\"&MONTH(Setup!$B$9)&\"/\"&YEAR(Setup!$B$9)","v":"ΣΤ' ΕΝΩΣΗ, Ε3 19η, ΣΑ ΤΡΙΠΟΛΗΣ, 12/5-13/5/2018"},null,null,null,null,null,null,{"$f":"Setup!B6&\" /md\"","v":"Α14 /md"},{"$f":"Setup!B6&\" /md\"","v":"Α14 /md"}]
["α/α","από","Α.Μ.","Ονοματεπώνυμο","Γέννηση","Σύλλογος","βαθμοί","Τηλέφωνο","Υπογραφή","SortPts","Rnd"]
[1,null,34598,"ΚΟΛΛΙΑΣ ΣΤΑΥΡΟΣ","2004-03-02","ΡΗΓΑΣ ΑΟΑ ΑΡΓΟΛΙΔΑΣ",122,null,null,{"$f":"IF(D3>\" \",G3+K3,0)","v":122.00348374826706},3.4837482670519765E-3,{"$f":"TRIM(IF(LEN(D3)<2,\"\",LEFT(D3,MIN(20,FIND(\" \",D3)-1))&MID(D3,FIND(\" \",D3),2)&\" (\"&LEFT(F3,12)&\")\"))","v":"ΚΟΛΛΙΑΣ Σ (ΡΗΓΑΣ ΑΟΑ ΑΡ)"}]
[2,null,36854,"ΚΥΡΙΑΚΟΠΟΥΛΟΣ ΑΝΔΡΕΑΣ","2005-05-23","ΑΟΑ ΠΑΤΡΩΝ",68,null,null,68.003876067295593,3.8760672955984376E-3,{"$f":"TRIM(IF(LEN(D4)<2,\"\",LEFT(D4,MIN(20,FIND(\" \",D4)-1))&MID(D4,FIND(\" \",D4),2)&\" (\"&LEFT(F4,12)&\")\"))","v":"ΚΥΡΙΑΚΟΠΟΥΛΟΣ Α (ΑΟΑ ΠΑΤΡΩΝ)"}]
[3,null,37036,"ΛΟΥΚΑ ΝΙΚΟΛΑΟΣ","2005-03-17","ΑΟΑ ΠΑΤΡΩΝ",47,null,null,47.0033274038326,3.3274038325997613E-3,"ΛΟΥΚΑ Ν (ΑΟΑ ΠΑΤΡΩΝ)"]
[4,null,36030,"ΤΟΥΝΤΑΣ ΜΑΡΙΟΣ","2005-06-04","ΡΗΓΑΣ ΑΟΑ ΑΡΓΟΛΙΔΑΣ",39.5,null,null,39.502204047994496,2.204047994497426E-3,"ΤΟΥΝΤΑΣ Μ (ΡΗΓΑΣ ΑΟΑ ΑΡ)"]
{"$rows_left_out":40}
{"sheet":"PrepOP","index":4,"n_rows":49,"n_cols":6,"rows_kept":49,"cut":false,"hidden":true,"merged":[]}
[{"$f":"Setup!$B$3&\", \"&Setup!$B$7&\", \"&Setup!$B$4&\", \"&DAY(Setup!$B$8)&\"/\"&MONTH(Setup!$B$8)&\"-\"&DAY(Setup!$B$9)&\"/\"&MONTH(Setup!$B$9)& \" (\" & Setup!B6 & \")\"","v":"ΣΤ' ΕΝΩΣΗ, Ε3 19η, ΣΑ ΤΡΙΠΟΛΗΣ, 12/5-13/5 (Α14)"}]
[{"$f":"Setup!$B$11","v":"ΚΑΛΟΓΡΗ Σ"}]
[null,null,"Πρόγραμμα αγώνων"]
[]
[null,null,"Round 32",null,null,"info"]
["ΩΡΑ","Κτγρ.","Αθλητής-Σύλλογος",null,"Αθλητής-Σύλλογος"]
{"$rows_left_out":44}
{"sheet":"tables","index":5,"n_rows":511,"n_cols":46,"rows_kept":511,"cut":false,"hidden":true,"merged":[]}
["RndIndx","random","FixRandom",null,null,null,"33-64","17-32","9-16","5-8","3-4","2ος","1ος",null,null,"Categories","Juniors","Serniors",null,null,null,"Tours",null,"Clubs","Id","Union",null,"Organizers",null,"Referees",null,"key","pts18",null,"KEY TourDetails","Date","TourName","CLUBid","CLUB","TYPE","GRP","GRPid","TDid",null,"Group","GroupID"]
[1,{"$f":"RAND()/222","v":3.7856081396999736E-3},3.4837482670519765E-3,null,null,"Ε1-12",null,5,7.5,10,15,25,30,null,null,null,"Α10","m35",null,null,null,"Παν",null,null,null,null,null,null,null,null,null,"Ε1S-12-1st",30,null,{"$f":"AJ2&AK2&AL2&AN2&AO2","v":"43113Ε3 2η (Β)152Sα12"},"2018-01-13","Ε3 2η (Β)",152,"ΟΑ ΚΑΛΑΜΑΡΙΑΣ","S","α12",5,3305,null,"Α10",3]
[2,9.7046652893520858E-4,3.8760672955984376E-3,null,null,"Ε1-14",null,10,15,20,30,50,60,null,null,"Α12","Α12","m40",null,null,null,"Ε3",null,"ΑΑ ΑΙΓΑΛΕΩ",366,"Θ",null,"ΕΦΟΑ",null,"Θα-ανακοινωθεί",null,"Ε1S-12-2nd",25,null,{"$f":"AJ3&AK3&AL3&AN3&AO3","v":"43113Ε3 2η (Β)152Sα16"},"2018-01-13","Ε3 2η (Β)",152,"ΟΑ ΚΑΛΑΜΑΡΙΑΣ","S","α16",7,3306,null,"Κ10",4]
[3,{"$f":"RAND()/222","v":4.3493604250106985E-3},3.3274038325997613E-3,null,null,"Ε1-16",null,20,30,40,60,100,120,null,null,"Α14","Α14","m45",null,null,null,"Ε4",null,"ΑΑ ΑΛΜΠΑΤΡΟΣ",124,"Β",null,"Α' ΕΝΩΣΗ",null,"ΑΛΕΞΙΟΥ Δ",null,"Ε1S-12-3_4",15,null,"43113Ε3 2η (Β)152Sκ12","2018-01-13","Ε3 2η (Β)",152,"ΟΑ ΚΑΛΑΜΑΡΙΑΣ","S","κ12",9,3307,null,"Α12",5]
[4,{"$f":"RAND()/222","v":2.438565538034453E-4},2.204047994497426E-3,null,null,"Ε1-18",null,25,37.5,50,75,125,150,null,null,"Α16","Α16","m50",null,null,null,"Open",null,"ΑΑ ΚΕΡΚΥΡΑΣ",201,"Δ",null,"Β' ΕΝΩΣΗ",null,"ΑΜΟΥΤΖΟΓΛΟΥ Κ",null,"Ε1S-12-5_8",10,null,"43113Ε3 2η (Β)152Sκ16","2018-01-13","Ε3 2η (Β)",152,"ΟΑ ΚΑΛΑΜΑΡΙΑΣ","S","κ16",11,3308,null,"Α14",6]
[5,{"$f":"RAND()/222","v":3.4079559619845522E-3},2.3056964345274204E-3,null,null,"Ε2-12",null,2.5,4,5,7.5,12.5,15,null,null,"Α18","Α18","m55",null,null,null,"ΠανΑΓ",null,"ΑΑ ΝΑΟΥΣΑΣ",169,"Γ",null,"Γ' ΕΝΩΣΗ",null,"ΑΞΑΡΛΗ Ν",null,"Ε1S-12-9_16",7.5,null,"43120Ε3 4η (Δ)217Sα12","2018-01-20","Ε3 4η (Δ)",217,"ΟΑ ΑΡΤΑΣ","S","α12",5,3309,null,"Α16",7]
{"$rows_left_out":506}
{"sheet":"matches","index":6,"n_rows":33,"n_cols":19,"rows_kept":33,"cut":false,"hidden":true,"merged":[]}
["round","W-ID","winner","L-ID","looser","score",null," Player "," Position ",null,"Set-up",null,null,"draw#","organizer","club","title","category","drawSize"]
[32,{"$f":"IF(OR(MD!$M$5 =1,MD!$M$5 =2), IF(MD!$M$5 =1,MD!$I$5,MD!$I$6),\"#\")","v":34598},{"$f":"TRIM(LEFT(VLOOKUP(B2,ALMD!$C$3:$D$34,2,FALSE),FIND(\" \",VLOOKUP(B2,ALMD!$C$3:$D$34,2,FALSE),1)-1))","v":"ΚΟΛΛΙΑΣ"},{"$f":"IF(OR(MD!$M$5 =1,MD!$M$5 =2), IF(MD!$M$5 =2,MD!$I$5,MD!$I$6),\"#\")","v":0},{"$f":"TRIM(LEFT(VLOOKUP(D2,ALMD!$C$3:$D$34,2,FALSE),FIND(\" \",VLOOKUP(D2,ALMD!$C$3:$D$34,2,FALSE),1)-1))","v":{"$error":"#N/A"}},{"$f":"MD!O6","v":0},null,{"$f":"B32","v":34598},"1st",null,"organizer: ",{"$f":"Setup!$B$3","v":"ΣΤ' ΕΝΩΣΗ"},null,{"$f":"IF(COUNTIF(MD!$I:$I,B2)>0,MATCH(B2,MD!$I:$I,0)-4,\"\")&\" \"&IF(COUNTIF(MD!$I:$I,D2)>0,MATCH(D2,MD!$I:$I,0)-4,\"\")","v":"1 2"},{"$f":"Setup!$B$3","v":"ΣΤ' ΕΝΩΣΗ"},{"$f":"TRIM(LEFT($L$4,10))","v":"ΣΑ ΤΡΙΠΟΛΗ"},{"$f":"TRIM(LEFT($L$3,10))","v":"Ε3 19η"},{"$f":"SUBSTITUTE(SUBSTITUTE(TRIM($L$7),\"Κ\",\"g\"),\"Α\",\"b\")","v":"b14"},32]
[32,{"$f":"IF(OR(MD!$M$7 =1,MD!$M$7 =2), IF(MD!$M$7 =1,MD!$I$7,MD!$I$8),\"#\")","v":34817},{"$f":"TRIM(LEFT(VLOOKUP(B3,ALMD!$C$3:$D$34,2,FALSE),FIND(\" \",VLOOKUP(B3,ALMD!$C$3:$D$34,2,FALSE),1)-1))","v":"ΤΖΟΥΤΖΟΠΟΥΛΟΣ"},{"$f":"IF(OR(MD!$M$7 =1,MD!$M$7 =2), IF(MD!$M$7 =2,MD!$I$7,MD!$I$8),\"#\")","v":33450},{"$f":"TRIM(LEFT(VLOOKUP(D3,ALMD!$C$3:$D$34,2,FALSE),FIND(\" \",VLOOKUP(D3,ALMD!$C$3:$D$34,2,FALSE),1)-1))","v":"ΚΑΜΠΑΝΟΣ"},{"$f":"MD!O8","v":"41 53"},null,{"$f":"D32","v":36030},"2nd",null,"title: ",{"$f":"Setup!$B$7","v":"Ε3 19η"},null,{"$f":"IF(COUNTIF(MD!$I:$I,B3)>0,MATCH(B3,MD!$I:$I,0)-4,\"\")&\" \"&IF(COUNTIF(MD!$I:$I,D3)>0,MATCH(D3,MD!$I:$I,0)-4,\"\")","v":"3 4"},{"$f":"Setup!$B$3","v":"ΣΤ' ΕΝΩΣΗ"},{"$f":"TRIM(LEFT($L$4,10))","v":"ΣΑ ΤΡΙΠΟΛΗ"},{"$f":"TRIM(LEFT($L$3,10))","v":"Ε3 19η"},{"$f":"SUBSTITUTE(SUBSTITUTE(TRIM($L$7),\"Κ\",\"g\"),\"Α\",\"b\")","v":"b14"},32]
[32,{"$f":"IF(OR(MD!$M$9 =1,MD!$M$9 =2), IF(MD!$M$9 =1,MD!$I$9,MD!$I$10),\"#\")","v":32578},{"$f":"TRIM(LEFT(VLOOKUP(B4,ALMD!$C$3:$D$34,2,FALSE),FIND(\" \",VLOOKUP(B4,ALMD!$C$3:$D$34,2,FALSE),1)-1))","v":"ΜΟΥΡΙΚΗΣ"},{"$f":"IF(OR(MD!$M$9 =1,MD!$M$9 =2), IF(MD!$M$9 =2,MD!$I$9,MD!$I$10),\"#\")","v":0},{"$f":"TRIM(LEFT(VLOOKUP(D4,ALMD!$C$3:$D$34,2,FALSE),FIND(\" \",VLOOKUP(D4,ALMD!$C$3:$D$34,2,FALSE),1)-1))","v":{"$error":"#N/A"}},{"$f":"MD!O10","v":0},null,{"$f":"D30","v":36852},"3_4",null,"club: ",{"$f":"Setup!$B$4","v":"ΣΑ ΤΡΙΠΟΛΗΣ"},null,{"$f":"IF(COUNTIF(MD!$I:$I,B4)>0,MATCH(B4,MD!$I:$I,0)-4,\"\")&\" \"&IF(COUNTIF(MD!$I:$I,D4)>0,MATCH(D4,MD!$I:$I,0)-4,\"\")","v":"5 2"},{"$f":"Setup!$B$3","v":"ΣΤ' ΕΝΩΣΗ"},"ΣΑ ΤΡΙΠΟΛΗ","Ε3 19η","b14",32]
[32,{"$f":"IF(OR(MD!$M$11=1,MD!$M$11=2), IF(MD!$M$11=1,MD!$I$11,MD!$I$12),\"#\")","v":30151},{"$f":"TRIM(LEFT(VLOOKUP(B5,ALMD!$C$3:$D$34,2,FALSE),FIND(\" \",VLOOKUP(B5,ALMD!$C$3:$D$34,2,FALSE),1)-1))","v":"ΚΑΡΑΝΑΓΝΩΣΤΗΣ"},{"$f":"IF(OR(MD!$M$11=1,MD!$M$11=2), IF(MD!$M$11=2,MD!$I$11,MD!$I$12),\"#\")","v":0},{"$f":"TRIM(LEFT(VLOOKUP(D5,ALMD!$C$3:$D$34,2,FALSE),FIND(\" \",VLOOKUP(D5,ALMD!$C$3:$D$34,2,FALSE),1)-1))","v":{"$error":"#N/A"}},{"$f":"MD!O12","v":0},null,{"$f":"D31","v":36854},"3_4",null,"grade: ",{"$f":"Setup!$B$5","v":"Ε3"},null,{"$f":"IF(COUNTIF(MD!$I:$I,B5)>0,MATCH(B5,MD!$I:$I,0)-4,\"\")&\" \"&IF(COUNTIF(MD!$I:$I,D5)>0,MATCH(D5,MD!$I:$I,0)-4,\"\")","v":"8 2"},{"$f":"Setup!$B$3","v":"ΣΤ' ΕΝΩΣΗ"},"ΣΑ ΤΡΙΠΟΛΗ","Ε3 19η","b14",32]
[32,{"$f":"IF(OR(MD!$M$13=1,MD!$M$13=2), IF(MD!$M$13=1,MD!$I$13,MD!$I$14),\"#\")","v":37036},{"$f":"TRIM(LEFT(VLOOKUP(B6,ALMD!$C$3:$D$34,2,FALSE),FIND(\" \",VLOOKUP(B6,ALMD!$C$3:$D$34,2,FALSE),1)-1))","v":"ΛΟΥΚΑ"},{"$f":"IF(OR(MD!$M$13=1,MD!$M$13=2), IF(MD!$M$13=2,MD!$I$13,MD!$I$14),\"#\")","v":0},{"$f":"TRIM(LEFT(VLOOKUP(D6,ALMD!$C$3:$D$34,2,FALSE),FIND(\" \",VLOOKUP(D6,ALMD!$C$3:$D$34,2,FALSE),1)-1))","v":{"$error":"#N/A"}},{"$f":"MD!O14","v":0},null,{"$f":"D26","v":30151},"5_8",null,"week: ",{"$f":"Setup!B10","v":"βδ.: 19η"},null,{"$f":"IF(COUNTIF(MD!$I:$I,B6)>0,MATCH(B6,MD!$I:$I,0)-4,\"\")&\" \"&IF(COUNTIF(MD!$I:$I,D6)>0,MATCH(D6,MD!$I:$I,0)-4,\"\")","v":"9 2"},{"$f":"Setup!$B$3","v":"ΣΤ' ΕΝΩΣΗ"},"ΣΑ ΤΡΙΠΟΛΗ","Ε3 19η","b14",32]
{"$rows_left_out":28}
{"sheet":"e-efoa","index":7,"n_rows":33,"n_cols":41,"rows_kept":33,"cut":false,"hidden":true,"merged":[]}
["organizer","club","title","group","Dsize","MStartDate","TournamentDetailsId","round","WPlayerCode","LPlayerCode","Score","WRow","LRow","WSeed","LSeed","W","L","n/m",null,"seed","cmnt","TournamentDetailsId"," PlayerCode","Round","Wins","Matches","PtsQ","PtsM","Age",null,"ID","name","row","seed",null,"RankKey",null,"MatcheNames","key","PlayerName 1","PlayerName 2"]
[{"$f":"Setup!$B$3","v":"ΣΤ' ΕΝΩΣΗ"},{"$f":"Setup!$Z$6","v":294},{"$f":"Setup!$Z$5","v":"Ε3 19η (ΣΤ)"},{"$f":"SUBSTITUTE(TRIM(Setup!$B$6),\"-\",\"\")","v":"Α14"},"Smd32",{"$f":"TEXT(Setup!$B$8,\"ΕΕΕΕ-ΜΜ-ΗΗ\")","v":"2018-05-12"},{"$f":"Setup!$T$7","v":{"$error":"#N/A"}},"R32",{"$f":"IF(OR(MD!$M$5 =1,MD!$M$5 =2), IF(MD!$M$5 =1,MD!$I$5,MD!$I$6),\"\")","v":34598},{"$f":"IF(OR(MD!$M$5 =1,MD!$M$5 =2), IF(MD!$M$5 =2,MD!$I$5,MD!$I$6),\"\")","v":0},{"$f":"TRIM(MD!O6)","v":""},{"$f":"IF(AND(I2<>\"\",I2>0),IF(VALUE(I2)>0,VLOOKUP(I2,$AE:$AH,3,FALSE),0),0)","v":1},{"$f":"IF(AND(J2<>\"\",J2>0),IF(VALUE(J2)>0,VLOOKUP(J2,$AE:$AH,3,FALSE),0),0)","v":0},{"$f":"IF(AND(I2<>\"\",I2>0),IF(VALUE(I2)>0,VLOOKUP(I2,$AE:$AH,4,FALSE),0),0)","v":1},{"$f":"IF(AND(J2<>\"\",J2>0),IF(VALUE(J2)>0,VLOOKUP(J2,$AE:$AH,4,FALSE),0),0)","v":0},{"$f":"IF($R2=\"\",I2,\"\")","v":""},{"$f":"IF($R2=\"\",J2,\"\")","v":""},{"$f":"IF(OR(J2=0,K2=\"\"),1,IF(TEXT(K2,\"0\")=SUBSTITUTE(LOWER(K2),\"m\",\"\"),\"\",1))","v":1},null,{"$f":"IF(W2<>\"\",IF(VALUE(W2)>0,VLOOKUP(W2,$AE:$AH,4,FALSE),\"\"),\"\")","v":1},{"$f":"IF(NOT(OR(W2=0,W2=\" \",W2=\"\")),IF(INDIRECT(\"ALMD!B\"&MATCH(W2,ALMD!$C$3:$C$34,0)+2)>0,INDIRECT(\"ALMD!B\"&MATCH(W2,ALMD!$C$3:$C$34,0)+2),\"\"),\"\")","v":""},{"$f":"Setup!$T$7","v":{"$error":"#N/A"}},{"$f":"I32","v":34598},"1st",{"$f":"IF($W2>0,COUNTIF($P$2:$P$32,$W2),0)","v":4},{"$f":"IF($W2>0,COUNTIF($P$2:$P$32,$W2)+COUNTIF($Q$2:$Q$32,$W2),0)","v":4},0,{"$f":"IF(OR($Z2=0,$Z2=\"\",$U2=\"DQ\"),0,VLOOKUP($AJ2,tables!$AF:$AG,2,FALSE))","v":18},{"$f":"IF(W2>0,YEAR(Setup!$B$8)-YEAR(VLOOKUP(W2,ALMD!$C:$F,3,FALSE)),0)","v":14},null,{"$f":"MD!$I5","v":34598},{"$f":"MD!$K5","v":"ΚΟΛΛΙΑΣ Σ"},{"$f":"IF(AE2>0,MD!$A5,\"\")","v":1},{"$f":"MD!$G5","v":1},null,{"$f":"SUBSTITUTE(SUBSTITUTE(Setup!$B$5&\"S-\"&Setup!$B$13&\"-\"&X2,\"Ανδ-\",\"\"),\"Γυν-\",\"\")","v":"Ε3S-14-1st"},null,{"$f":"IF(AO2>\" \", IF(OR(AM2=AM3,AM2=AM1), IF(AM2=AM3,AN2&\"/\"&AN3&\" - \"&AO2&\"/\"&AO3, AN1&\"/\"&AN2&\" - \"&AO1&\"/\"&AO2),AN2&\" - \"&AO2), IF(OR(AM2=AM3,AM2=AM1), IF(AM2=AM3,AN2&\"/\"&AN3, AN1&\"/\"&AN2),AN2))","v":{"$error":"#N/A"}},{"$f":"G2&H2&L2","v":{"$error":"#N/A"}},{"$f":"IF(I2<=0,\"\",TRIM(LEFT(LEFT(VLOOKUP(I2,$AE:$AF,2,FALSE),FIND(\" \",VLOOKUP(I2,$AE:$AF,2,FALSE),1)-1),15)&\" \"&LEFT(MID(VLOOKUP(I2,$AE:$AF,2,FALSE),FIND(\" \",VLOOKUP(I2,$AE:$AF,2,FALSE),1)+1,20),3)))","v":"ΚΟΛΛΙΑΣ Σ"},""]
[{"$f":"Setup!$B$3","v":"ΣΤ' ΕΝΩΣΗ"},{"$f":"Setup!$Z$6","v":294},{"$f":"Setup!$Z$5","v":"Ε3 19η (ΣΤ)"},{"$f":"SUBSTITUTE(TRIM(Setup!$B$6),\"-\",\"\")","v":"Α14"},"Smd32",{"$f":"TEXT(Setup!$B$8,\"ΕΕΕΕ-ΜΜ-ΗΗ\")","v":"2018-05-12"},{"$f":"Setup!$T$7","v":{"$error":"#N/A"}},"R32",{"$f":"IF(OR(MD!$M$7 =1,MD!$M$7 =2), IF(MD!$M$7 =1,MD!$I$7,MD!$I$8),\"\")","v":34817},{"$f":"IF(OR(MD!$M$7 =1,MD!$M$7 =2), IF(MD!$M$7 =2,MD!$I$7,MD!$I$8),\"\")","v":33450},{"$f":"TRIM(MD!O8)","v":"41 53"},{"$f":"IF(AND(I3<>\"\",I3>0),IF(VALUE(I3)>0,VLOOKUP(I3,$AE:$AH,3,FALSE),0),0)","v":3},{"$f":"IF(AND(J3<>\"\",J3>0),IF(VALUE(J3)>0,VLOOKUP(J3,$AE:$AH,3,FALSE),0),0)","v":4},{"$f":"IF(AND(I3<>\"\",I3>0),IF(VALUE(I3)>0,VLOOKUP(I3,$AE:$AH,4,FALSE),0),0)","v":13},{"$f":"IF(AND(J3<>\"\",J3>0),IF(VALUE(J3)>0,VLOOKUP(J3,$AE:$AH,4,FALSE),0),0)","v":9},{"$f":"IF($R3=\"\",I3,\"\")","v":34817},{"$f":"IF($R3=\"\",J3,\"\")","v":33450},{"$f":"IF(OR(J3=0,K3=\"\"),1,IF(TEXT(K3,\"0\")=SUBSTITUTE(LOWER(K3),\"m\",\"\"),\"\",1))","v":""},null,4,{"$f":"IF(NOT(OR(W3=0,W3=\" \",W3=\"\")),IF(INDIRECT(\"ALMD!B\"&MATCH(W3,ALMD!$C$3:$C$34,0)+2)>0,INDIRECT(\"ALMD!B\"&MATCH(W3,ALMD!$C$3:$C$34,0)+2),\"\"),\"\")","v":""},{"$f":"Setup!$T$7","v":{"$error":"#N/A"}},{"$f":"J32","v":36030},"2nd",{"$f":"IF($W3>0,COUNTIF($P$2:$P$32,$W3),0)","v":3},{"$f":"IF($W3>0,COUNTIF($P$2:$P$32,$W3)+COUNTIF($Q$2:$Q$32,$W3),0)","v":4},0,{"$f":"IF(OR($Z3=0,$Z3=\"\",$U3=\"DQ\"),0,VLOOKUP($AJ3,tables!$AF:$AG,2,FALSE))","v":15},{"$f":"IF(W3>0,YEAR(Setup!$B$8)-YEAR(VLOOKUP(W3,ALMD!$C:$F,3,FALSE)),0)","v":13},null,{"$f":"MD!$I6","v":0},{"$f":"MD!$K6","v":""},{"$f":"IF(AE3>0,MD!$A6,\"\")","v":""},{"$f":"MD!$G6","v":"-"},null,{"$f":"SUBSTITUTE(SUBSTITUTE(Setup!$B$5&\"S-\"&Setup!$B$13&\"-\"&X3,\"Ανδ-\",\"\"),\"Γυν-\",\"\")","v":"Ε3S-14-2nd"},null,{"$error":"#N/A"},{"$error":"#N/A"},"ΤΖΟΥΤΖΟΠΟΥΛΟΣ Θ","ΚΑΜΠΑΝΟΣ Ε"]
[{"$f":"Setup!$B$3","v":"ΣΤ' ΕΝΩΣΗ"},{"$f":"Setup!$Z$6","v":294},{"$f":"Setup!$Z$5","v":"Ε3 19η (ΣΤ)"},{"$f":"SUBSTITUTE(TRIM(Setup!$B$6),\"-\",\"\")","v":"Α14"},"Smd32",{"$f":"TEXT(Setup!$B$8,\"ΕΕΕΕ-ΜΜ-ΗΗ\")","v":"2018-05-12"},{"$f":"Setup!$T$7","v":{"$error":"#N/A"}},"R32",{"$f":"IF(OR(MD!$M$9 =1,MD!$M$9 =2), IF(MD!$M$9 =1,MD!$I$9,MD!$I$10),\"\")","v":32578},{"$f":"IF(OR(MD!$M$9 =1,MD!$M$9 =2), IF(MD!$M$9 =2,MD!$I$9,MD!$I$10),\"\")","v":0},{"$f":"TRIM(MD!O10)","v":""},5,0,16,0,"","",1,null,5,{"$f":"IF(NOT(OR(W4=0,W4=\" \",W4=\"\")),IF(INDIRECT(\"ALMD!B\"&MATCH(W4,ALMD!$C$3:$C$34,0)+2)>0,INDIRECT(\"ALMD!B\"&MATCH(W4,ALMD!$C$3:$C$34,0)+2),\"\"),\"\")","v":""},{"$f":"Setup!$T$7","v":{"$error":"#N/A"}},{"$f":"J30","v":36852},"3_4",2,3,0,{"$f":"IF(OR($Z4=0,$Z4=\"\",$U4=\"DQ\"),0,VLOOKUP($AJ4,tables!$AF:$AG,2,FALSE))","v":9},{"$f":"IF(W4>0,YEAR(Setup!$B$8)-YEAR(VLOOKUP(W4,ALMD!$C:$F,3,FALSE)),0)","v":12},null,{"$f":"MD!$I7","v":34817},{"$f":"MD!$K7","v":"ΤΖΟΥΤΖΟΠΟΥΛΟΣ Θ"},{"$f":"IF(AE4>0,MD!$A7,\"\")","v":3},{"$f":"MD!$G7","v":13},null,{"$f":"SUBSTITUTE(SUBSTITUTE(Setup!$B$5&\"S-\"&Setup!$B$13&\"-\"&X4,\"Ανδ-\",\"\"),\"Γυν-\",\"\")","v":"Ε3S-14-3_4"},null,{"$error":"#N/A"},{"$error":"#N/A"},"ΜΟΥΡΙΚΗΣ Κ",""]
[{"$f":"Setup!$B$3","v":"ΣΤ' ΕΝΩΣΗ"},{"$f":"Setup!$Z$6","v":294},{"$f":"Setup!$Z$5","v":"Ε3 19η (ΣΤ)"},{"$f":"SUBSTITUTE(TRIM(Setup!$B$6),\"-\",\"\")","v":"Α14"},"Smd32",{"$f":"TEXT(Setup!$B$8,\"ΕΕΕΕ-ΜΜ-ΗΗ\")","v":"2018-05-12"},{"$f":"Setup!$T$7","v":{"$error":"#N/A"}},"R32",{"$f":"IF(OR(MD!$M$11=1,MD!$M$11=2), IF(MD!$M$11=1,MD!$I$11,MD!$I$12),\"\")","v":30151},{"$f":"IF(OR(MD!$M$11=1,MD!$M$11=2), IF(MD!$M$11=2,MD!$I$11,MD!$I$12),\"\")","v":0},{"$f":"TRIM(MD!O12)","v":""},8,0,6,0,"","",1,null,2,{"$f":"IF(NOT(OR(W5=0,W5=\" \",W5=\"\")),IF(INDIRECT(\"ALMD!B\"&MATCH(W5,ALMD!$C$3:$C$34,0)+2)>0,INDIRECT(\"ALMD!B\"&MATCH(W5,ALMD!$C$3:$C$34,0)+2),\"\"),\"\")","v":""},{"$f":"Setup!$T$7","v":{"$error":"#N/A"}},{"$f":"J31","v":36854},"3_4",2,3,0,{"$f":"IF(OR($Z5=0,$Z5=\"\",$U5=\"DQ\"),0,VLOOKUP($AJ5,tables!$AF:$AG,2,FALSE))","v":9},{"$f":"IF(W5>0,YEAR(Setup!$B$8)-YEAR(VLOOKUP(W5,ALMD!$C:$F,3,FALSE)),0)","v":13},null,{"$f":"MD!$I8","v":33450},{"$f":"MD!$K8","v":"ΚΑΜΠΑΝΟΣ Ε"},{"$f":"IF(AE5>0,MD!$A8,\"\")","v":4},{"$f":"MD!$G8","v":9},null,{"$f":"SUBSTITUTE(SUBSTITUTE(Setup!$B$5&\"S-\"&Setup!$B$13&\"-\"&X5,\"Ανδ-\",\"\"),\"Γυν-\",\"\")","v":"Ε3S-14-3_4"},null,{"$error":"#N/A"},{"$error":"#N/A"},"ΚΑΡΑΝΑΓΝΩΣΤΗΣ Κ",""]
[{"$f":"Setup!$B$3","v":"ΣΤ' ΕΝΩΣΗ"},{"$f":"Setup!$Z$6","v":294},{"$f":"Setup!$Z$5","v":"Ε3 19η (ΣΤ)"},{"$f":"SUBSTITUTE(TRIM(Setup!$B$6),\"-\",\"\")","v":"Α14"},"Smd32",{"$f":"TEXT(Setup!$B$8,\"ΕΕΕΕ-ΜΜ-ΗΗ\")","v":"2018-05-12"},{"$f":"Setup!$T$7","v":{"$error":"#N/A"}},"R32",{"$f":"IF(OR(MD!$M$13=1,MD!$M$13=2), IF(MD!$M$13=1,MD!$I$13,MD!$I$14),\"\")","v":37036},{"$f":"IF(OR(MD!$M$13=1,MD!$M$13=2), IF(MD!$M$13=2,MD!$I$13,MD!$I$14),\"\")","v":0},{"$f":"TRIM(MD!O14)","v":""},9,0,3,0,"","",1,null,6,{"$f":"IF(NOT(OR(W6=0,W6=\" \",W6=\"\")),IF(INDIRECT(\"ALMD!B\"&MATCH(W6,ALMD!$C$3:$C$34,0)+2)>0,INDIRECT(\"ALMD!B\"&MATCH(W6,ALMD!$C$3:$C$34,0)+2),\"\"),\"\")","v":""},{"$f":"Setup!$T$7","v":{"$error":"#N/A"}},{"$f":"J26","v":30151},"5_8",1,2,0,{"$f":"IF(OR($Z6=0,$Z6=\"\",$U6=\"DQ\"),0,VLOOKUP($AJ6,tables!$AF:$AG,2,FALSE))","v":6},{"$f":"IF(W6>0,YEAR(Setup!$B$8)-YEAR(VLOOKUP(W6,ALMD!$C:$F,3,FALSE)),0)","v":14},null,{"$f":"MD!$I9","v":32578},{"$f":"MD!$K9","v":"ΜΟΥΡΙΚΗΣ Κ"},{"$f":"IF(AE6>0,MD!$A9,\"\")","v":5},{"$f":"MD!$G9","v":16},null,{"$f":"SUBSTITUTE(SUBSTITUTE(Setup!$B$5&\"S-\"&Setup!$B$13&\"-\"&X6,\"Ανδ-\",\"\"),\"Γυν-\",\"\")","v":"Ε3S-14-5_8"},null,{"$error":"#N/A"},{"$error":"#N/A"},"ΛΟΥΚΑ Ν",""]
{"$rows_left_out":27}